Reaction Details
TargetOxysterols receptor LXR-beta
LigandBDBM19993
Substrate/Competitorn/a
Meas. Tech.ChEMBL_604020 (CHEMBL1049548)
EC50 170±n/a nM
Citation Hu, BBernotas, RUnwalla, RCollini, MQuinet, EFeingold, IGoos-Nilsson, AWilhelmsson, ANambi, PEvans, MWrobel, J Quinoline-3-carboxamide containing sulfones as liver X receptor (LXR) agonists with binding selectivity for LXRbeta and low blood-brain penetration. Bioorg Med Chem Lett20:689-93 (2010) 
 
Oxysterols receptor LXR-beta
Name:Oxysterols receptor LXR-beta
Type:Enzyme Catalytic Domain
Mol. Mass.:50978.79
Organism:Homo sapiens (Human)
Description:P55055
Residue:460
BDBM19993
NameBDBM19993
Synonyms:CHEMBL62136 T 0901317 TO-901317 US10669296, Compound TO901317 [3H]T0901317
TypeSmall organic molecule
Emp. Form.C17H12F9NO3S
Mol. Mass.481.333
SMILESOC(c1ccc(cc1)N(CC(F)(F)F)S(=O)(=O)c1ccccc1)(C(F)(F)F)C(F)(F)F