Reaction Details
TargetAurora kinase B
LigandBDBM50310616
Substrate/Competitorn/a
Meas. Tech.ChEMBL_620386 (CHEMBL1112281)
IC50 1400±n/a nM
Citation Zhong, MBui, MShen, WBaskaran, SAllen, DAElling, RAFlanagan, WMFung, ADHanan, EJHarris, SOHeumann, SAHoch, UIvy, SNJacobs, JWLam, SLee, HMcDowell, RSOslob, JDPurkey, HERomanowski, MJSilverman, JATangonan, BTTaverna, PYang, WYoburn, JCYu, CHZimmerman, KMO'Brien, TLew, W 2-Aminobenzimidazoles as potent Aurora kinase inhibitors. Bioorg Med Chem Lett19:5158-61 (2009) 
 
Aurora kinase B
Name:Aurora kinase B
Type:Protein
Mol. Mass.:39327.72
Organism:Homo sapiens (Human)
Description:Q96GD4
Residue:344
BDBM50310616
NameBDBM50310616
Synonyms:CHEMBL1078927 | N-(3-(1H-benzo[d]imidazol-2-ylamino)phenethyl)thieno[3,2-d]pyrimidin-4-amine
TypeSmall organic molecule
Emp. Form.C21H18N6S
Mol. Mass.386.473
SMILESC(Cc1cccc(Nc2nc3ccccc3[nH]2)c1)Nc1ncnc2ccsc12