Reaction Details
TargetAurora kinase B
LigandBDBM26320
Substrate/Competitorn/a
Meas. Tech.ChEMBL_620386 (CHEMBL1112281)
IC50 120±n/a nM
Citation Zhong, MBui, MShen, WBaskaran, SAllen, DAElling, RAFlanagan, WMFung, ADHanan, EJHarris, SOHeumann, SAHoch, UIvy, SNJacobs, JWLam, SLee, HMcDowell, RSOslob, JDPurkey, HERomanowski, MJSilverman, JATangonan, BTTaverna, PYang, WYoburn, JCYu, CHZimmerman, KMO'Brien, TLew, W 2-Aminobenzimidazoles as potent Aurora kinase inhibitors. Bioorg Med Chem Lett19:5158-61 (2009) 
 
Aurora kinase B
Name:Aurora kinase B
Type:Protein
Mol. Mass.:39327.72
Organism:Homo sapiens (Human)
Description:Q96GD4
Residue:344
BDBM26320
NameBDBM26320
Synonyms:1-phenyl-3-[5-(2-{thieno[3,2-d]pyrimidin-4-ylamino}ethyl)-1,3-thiazol-2-yl]urea thieno[3,2-d]pyrimidine analogue, 15
TypeSmall organic molecule
Emp. Form.C18H16N6OS2
Mol. Mass.396.489
SMILESO=C(Nc1ncc(CCNc2ncnc3ccsc23)s1)Nc1ccccc1