Reaction Details
TargetAurora kinase A
LigandBDBM50310620
Substrate/Competitorn/a
Meas. Tech.ChEMBL_620385 (CHEMBL1112280)
IC50 20±n/a nM
Citation Zhong, MBui, MShen, WBaskaran, SAllen, DAElling, RAFlanagan, WMFung, ADHanan, EJHarris, SOHeumann, SAHoch, UIvy, SNJacobs, JWLam, SLee, HMcDowell, RSOslob, JDPurkey, HERomanowski, MJSilverman, JATangonan, BTTaverna, PYang, WYoburn, JCYu, CHZimmerman, KMO'Brien, TLew, W 2-Aminobenzimidazoles as potent Aurora kinase inhibitors. Bioorg Med Chem Lett19:5158-61 (2009) 
 
Aurora kinase A
Name:Aurora kinase A
Type:Serine/threonine-protein kinase
Mol. Mass.:45830.98
Organism:Homo sapiens (Human)
Description:O14965
Residue:403
BDBM50310620
NameBDBM50310620
Synonyms:CHEMBL1079713 | N-(4-(6-chloro-3H-imidazo[4,5-b]pyridin-2-ylamino)phenethyl)thieno[3,2-d]pyrimidin-4-amine
TypeSmall organic molecule
Emp. Form.C20H16ClN7S
Mol. Mass.421.906
SMILESClc1cnc2nc(Nc3ccc(CCNc4ncnc5ccsc45)cc3)[nH]c2c1