Reaction Details
TargetAurora kinase A
LigandBDBM26320
Substrate/Competitorn/a
Meas. Tech.ChEMBL_620385 (CHEMBL1112280)
IC50 52±n/a nM
Citation Zhong, MBui, MShen, WBaskaran, SAllen, DAElling, RAFlanagan, WMFung, ADHanan, EJHarris, SOHeumann, SAHoch, UIvy, SNJacobs, JWLam, SLee, HMcDowell, RSOslob, JDPurkey, HERomanowski, MJSilverman, JATangonan, BTTaverna, PYang, WYoburn, JCYu, CHZimmerman, KMO'Brien, TLew, W 2-Aminobenzimidazoles as potent Aurora kinase inhibitors. Bioorg Med Chem Lett19:5158-61 (2009) 
 
Aurora kinase A
Name:Aurora kinase A
Type:Serine/threonine-protein kinase
Mol. Mass.:45830.98
Organism:Homo sapiens (Human)
Description:O14965
Residue:403
BDBM26320
NameBDBM26320
Synonyms:1-phenyl-3-[5-(2-{thieno[3,2-d]pyrimidin-4-ylamino}ethyl)-1,3-thiazol-2-yl]urea thieno[3,2-d]pyrimidine analogue, 15
TypeSmall organic molecule
Emp. Form.C18H16N6OS2
Mol. Mass.396.489
SMILESO=C(Nc1ncc(CCNc2ncnc3ccsc23)s1)Nc1ccccc1