Reaction Details
TargetCytochrome P450 3A4
LigandBDBM50311413
Substrate/Competitorn/a
Meas. Tech.ChEMBL_622574 (CHEMBL1109286)
IC50>8000±n/a nM
Citation Bailey, JMScott, JSBasilla, JBBolton, VJBoyfield, IEvans, DGFleury, EHeightman, TDJarvie, EMLawless, KMatthews, KLMcKay, FMok, HMuir, AOrlek, BSSanger, GJStemp, GStevens, AJThompson, MWard, JVaidya, KWestaway, SM The discovery and optimisation of benzazepine sulfonamide and sulfones as potent agonists of the motilin receptor. Bioorg Med Chem Lett19:6452-8 (2009) 
 
Cytochrome P450 3A4
Name:Cytochrome P450 3A4
Type:Enzyme
Mol. Mass.:57349.57
Organism:Homo sapiens (Human)
Description:n/a
Residue:503
BDBM50311413
NameBDBM50311413
Synonyms:CHEMBL1078595 | N-(3-((1H-pyrazol-3-yl)methyl)-2,3,4,5-tetrahydro-1H-benzo[d]azepin-7-yl)-6-morpholinopyridine-3-sulfonamide
TypeSmall organic molecule
Emp. Form.C23H28N6O3S
Mol. Mass.468.572
SMILESO=S(=O)(Nc1ccc2CCN(Cc3ccn[nH]3)CCc2c1)c1ccc(nc1)N1CCOCC1