Reaction Details
TargetCytochrome P450 2D6
LigandBDBM50311418
Substrate/Competitorn/a
Meas. Tech.ChEMBL_622573 (CHEMBL1109285)
IC50 16000±n/a nM
Citation Bailey, JMScott, JSBasilla, JBBolton, VJBoyfield, IEvans, DGFleury, EHeightman, TDJarvie, EMLawless, KMatthews, KLMcKay, FMok, HMuir, AOrlek, BSSanger, GJStemp, GStevens, AJThompson, MWard, JVaidya, KWestaway, SM The discovery and optimisation of benzazepine sulfonamide and sulfones as potent agonists of the motilin receptor. Bioorg Med Chem Lett19:6452-8 (2009) 
 
Cytochrome P450 2D6
Name:Cytochrome P450 2D6
Type:Protein
Mol. Mass.:55774.82
Organism:Homo sapiens (Human)
Description:P10635
Residue:497
BDBM50311418
NameBDBM50311418
Synonyms:CHEMBL1080047 | N-(3-((1H-pyrazol-3-yl)methyl)-2,3,4,5-tetrahydro-1H-benzo[d]azepin-7-yl)propane-2-sulfonamide
TypeSmall organic molecule
Emp. Form.C17H24N4O2S
Mol. Mass.348.463
SMILESCC(C)S(=O)(=O)Nc1ccc2CCN(Cc3ccn[nH]3)CCc2c1