Reaction Details
TargetOxysterols receptor LXR-alpha
LigandBDBM50317746
Substrate/Competitorn/a
Meas. Tech.ChEMBL_629444 (CHEMBL1105797)
IC50 32±n/a nM
Citation Ullrich, JWMorris, RBernotas, RCTravins, JMJetter, JUnwalla, RQuinet, ENambi, PFeingold, IHuselton, CEnroth, CWilhelmsson, AGoos-Nilsson, AWrobel, J Synthesis of 4-(3-biaryl)quinoline sulfones as potent liver X receptor agonists. Bioorg Med Chem Lett20:2903-7 (2010) 
 
Oxysterols receptor LXR-alpha
Name:Oxysterols receptor LXR-alpha
Type:Enzyme Catalytic Domain
Mol. Mass.:50403.85
Organism:Homo sapiens (Human)
Description:Q13133
Residue:447
BDBM50317746
NameBDBM50317746
Synonyms:4-(4'-fluoro-3'-(methylsulfonyl)biphenyl-3-yl)-8-(trifluoromethyl)quinoline | CHEMBL1097160
TypeSmall organic molecule
Emp. Form.C23H15F4NO2S
Mol. Mass.445.429
SMILESCS(=O)(=O)c1cc(ccc1F)-c1cccc(c1)-c1ccnc2c(cccc12)C(F)(F)F