Reaction Details
TargetMitogen-activated protein kinase 14
LigandBDBM20657
Substrate/Competitorn/a
Meas. Tech.ChEMBL_663513 (CHEMBL1251166)
IC50 2.2±n/a nM
Citation Liu, CLin, JWrobleski, STLin, SHynes, JWu, HDyckman, AJLi, TWityak, JGillooly, KMPitt, SShen, DRZhang, RFMcIntyre, KWSalter-Cid, LShuster, DJZhang, HMarathe, PHDoweyko, AMSack, JSKiefer, SEKish, KFNewitt, JAMcKinnon, MDodd, JHBarrish, JCSchieven, GLLeftheris, K Discovery of 4-(5-(cyclopropylcarbamoyl)-2-methylphenylamino)-5-methyl-N-propylpyrrolo[1,2-f][1,2,4]triazine-6-carboxamide (BMS-582949), a clinical p38a MAP kinase inhibitor for the treatment of inflammatory diseases. J Med Chem53:6629-39 (2010) 
 
Mitogen-activated protein kinase 14
Name:Mitogen-activated protein kinase 14
Type:Serine/threonine-protein kinase
Mol. Mass.:41286.76
Organism:Homo sapiens (Human)
Description:Q16539
Residue:360
BDBM20657
NameBDBM20657
Synonyms:4-{[5-(methoxycarbamoyl)-2-methylphenyl]amino}-5-methyl-N-[(1S)-1-phenylethyl]pyrrolo[1,2-a][1,2,4]triazine-6-carboxamide | pyrrolo[2,1-f][1,2,4]triazine analogue, 11j
TypeSmall organic molecule
Emp. Form.C25H26N6O3
Mol. Mass.458.5123
SMILESCONC(=O)c1ccc(C)c(Nc2ncnn3cc(C(=O)N[C@@H](C)c4ccccc4)c(C)c23)c1