Reaction Details
TargetMitogen-activated protein kinase 14
LigandBDBM50327020
Substrate/Competitorn/a
Meas. Tech.ChEMBL_663513 (CHEMBL1251166)
IC50 3.9±n/a nM
Citation Liu, CLin, JWrobleski, STLin, SHynes, JWu, HDyckman, AJLi, TWityak, JGillooly, KMPitt, SShen, DRZhang, RFMcIntyre, KWSalter-Cid, LShuster, DJZhang, HMarathe, PHDoweyko, AMSack, JSKiefer, SEKish, KFNewitt, JAMcKinnon, MDodd, JHBarrish, JCSchieven, GLLeftheris, K Discovery of 4-(5-(cyclopropylcarbamoyl)-2-methylphenylamino)-5-methyl-N-propylpyrrolo[1,2-f][1,2,4]triazine-6-carboxamide (BMS-582949), a clinical p38a MAP kinase inhibitor for the treatment of inflammatory diseases. J Med Chem53:6629-39 (2010) 
 
Mitogen-activated protein kinase 14
Name:Mitogen-activated protein kinase 14
Type:Serine/threonine-protein kinase
Mol. Mass.:41286.76
Organism:Homo sapiens (Human)
Description:Q16539
Residue:360
BDBM50327020
NameBDBM50327020
Synonyms:4-(5-(Isoxazol-3-ylcarbamoyl)-2-methylphenylamino)-5-methyl-N-propylpyrrolo[1,2-f][1,2,4]triazine-6-carboxamide CHEMBL1230070
TypeSmall organic molecule
Emp. Form.C22H23N7O3
Mol. Mass.433.4631
SMILESCCCNC(=O)c1cn2ncnc(Nc3cc(ccc3C)C(=O)Nc3ccon3)c2c1C