Reaction Details
TargetCytochrome P450 2C9
LigandBDBM50327009
Substrate/Competitorn/a
Meas. Tech.ChEMBL_663501 (CHEMBL1251100)
IC50>40000±n/a nM
Citation Liu, CLin, JWrobleski, STLin, SHynes, JWu, HDyckman, AJLi, TWityak, JGillooly, KMPitt, SShen, DRZhang, RFMcIntyre, KWSalter-Cid, LShuster, DJZhang, HMarathe, PHDoweyko, AMSack, JSKiefer, SEKish, KFNewitt, JAMcKinnon, MDodd, JHBarrish, JCSchieven, GLLeftheris, K Discovery of 4-(5-(cyclopropylcarbamoyl)-2-methylphenylamino)-5-methyl-N-propylpyrrolo[1,2-f][1,2,4]triazine-6-carboxamide (BMS-582949), a clinical p38a MAP kinase inhibitor for the treatment of inflammatory diseases. J Med Chem53:6629-39 (2010) 
 
Cytochrome P450 2C9
Name:Cytochrome P450 2C9
Type:Enzyme
Mol. Mass.:55636.33
Organism:Homo sapiens (Human)
Description:P11712
Residue:490
BDBM50327009
NameBDBM50327009
Synonyms:4-(5-(Cyclopropylcarbamoyl)-2-methylphenylamino)-5-methyl-N-propylpyrrolo[1,2-f][1,2,4]triazine-6-carboxamide CHEMBL1230065
TypeSmall organic molecule
Emp. Form.C22H26N6O2
Mol. Mass.406.4808
SMILESCCCNC(=O)c1cn2ncnc(Nc3cc(ccc3C)C(=O)NC3CC3)c2c1C