Reaction Details
TargetDelta-type opioid receptor
LigandBDBM50327256
Substrate/Competitorn/a
Meas. Tech.ChEMBL_664323 (CHEMBL1259358)
IC50 4842±n/a nM
Citation Brugel, TASmith, RWBalestra, MBecker, CDaniels, THoerter, TNKoether, GMThroner, SRPanko, LMFolmer, JJCacciola, JHunter, AMLiu, REdwards, PDBrown, DGGordon, JLedonne, NCPietras, MSchroeder, PSygowski, LAHirata, LTZacco, APeters, MF Discovery of 8-azabicyclo[3.2.1]octan-3-yloxy-benzamides as selective antagonists of the kappa opioid receptor. Part 1. Bioorg Med Chem Lett20:5847-52 (2010) 
 
Delta-type opioid receptor
Name:Delta-type opioid receptor
Type:G Protein-Coupled Receptor (GPCR)
Mol. Mass.:40382.98
Organism:Homo sapiens (Human)
Description:Competition binding assays were carried out using membrane preparations from transfected HN9.10 cells that constitutively expressed the delta opioid receptor.
Residue:372
BDBM50327256
NameBDBM50327256
Synonyms:CHEMBL1258280 | endo-3-(8-(benzo[d][1,3]dioxol-5-ylmethyl)-8-azabicyclo[3.2.1]octan-3-yloxy)benzamide
TypeSmall organic molecule
Emp. Form.C22H24N2O4
Mol. Mass.380.437
SMILESNC(=O)c1cccc(O[C@H]2C[C@@H]3CC[C@H](C2)N3Cc2ccc3OCOc3c2)c1