Reaction Details
TargetKappa-type opioid receptor
LigandBDBM50327257
Substrate/Competitorn/a
Meas. Tech.ChEMBL_664321 (CHEMBL1259356)
IC50 77±n/a nM
Citation Brugel, TASmith, RWBalestra, MBecker, CDaniels, THoerter, TNKoether, GMThroner, SRPanko, LMFolmer, JJCacciola, JHunter, AMLiu, REdwards, PDBrown, DGGordon, JLedonne, NCPietras, MSchroeder, PSygowski, LAHirata, LTZacco, APeters, MF Discovery of 8-azabicyclo[3.2.1]octan-3-yloxy-benzamides as selective antagonists of the kappa opioid receptor. Part 1. Bioorg Med Chem Lett20:5847-52 (2010) 
 
Kappa-type opioid receptor
Name:Kappa-type opioid receptor
Type:G Protein-Coupled Receptor (GPCR)
Mol. Mass.:42648.76
Organism:Homo sapiens (Human)
Description:P41145
Residue:380
BDBM50327257
NameBDBM50327257
Synonyms:3-(1-(cyclopropylmethyl)piperidin-4-yloxy)-N-(3-(3-morpholinobenzamido)phenyl)benzamide | CHEMBL1257346
TypeSmall organic molecule
Emp. Form.C33H38N4O4
Mol. Mass.554.6792
SMILESO=C(Nc1cccc(NC(=O)c2cccc(c2)N2CCOCC2)c1)c1cccc(OC2CCN(CC3CC3)CC2)c1