Reaction Details
TargetKappa-type opioid receptor
LigandBDBM50327258
Substrate/Competitorn/a
Meas. Tech.ChEMBL_664339 (CHEMBL1259488)
Ki 146±n/a nM
Citation Brugel, TASmith, RWBalestra, MBecker, CDaniels, THoerter, TNKoether, GMThroner, SRPanko, LMFolmer, JJCacciola, JHunter, AMLiu, REdwards, PDBrown, DGGordon, JLedonne, NCPietras, MSchroeder, PSygowski, LAHirata, LTZacco, APeters, MF Discovery of 8-azabicyclo[3.2.1]octan-3-yloxy-benzamides as selective antagonists of the kappa opioid receptor. Part 1. Bioorg Med Chem Lett20:5847-52 (2010) 
 
Kappa-type opioid receptor
Name:Kappa-type opioid receptor
Type:G Protein-Coupled Receptor (GPCR)
Mol. Mass.:42648.76
Organism:Homo sapiens (Human)
Description:P41145
Residue:380
BDBM50327258
NameBDBM50327258
Synonyms:3-(1-(cyclopropylmethyl)piperidin-4-yloxy)benzamide | CHEMBL1256487
TypeSmall organic molecule
Emp. Form.C16H22N2O2
Mol. Mass.274.3581
SMILESNC(=O)c1cccc(OC2CCN(CC3CC3)CC2)c1