Reaction Details
TargetSerine/threonine-protein kinase mTOR
LigandBDBM50327901
Substrate/Competitorn/a
Meas. Tech.ChEMBL_665023 (CHEMBL1260133)
Ki 18±n/a nM
Citation Liu, KKBagrodia, SBailey, SCheng, HChen, HGao, LGreasley, SHoffman, JEHu, QJohnson, TOKnighton, DLiu, ZMarx, MANambu, MDNinkovic, SPascual, BRafidi, KRodgers, CMSmith, GLSun, SWang, HYang, AYuan, JZou, A 4-methylpteridinones as orally active and selective PI3K/mTOR dual inhibitors. Bioorg Med Chem Lett20:6096-9 (2010) 
 
Serine/threonine-protein kinase mTOR
Name:Serine/threonine-protein kinase mTOR
Type:Rapamycin target protein
Mol. Mass.:288917.12
Organism:Homo sapiens (Human)
Description:P42345
Residue:2549
BDBM50327901
NameBDBM50327901
Synonyms:2-amino-8-isopropyl-6-(2-methoxypyrimidin-5-yl)-4-methylpteridin-7(8H)-one | CHEMBL1258791
TypeSmall organic molecule
Emp. Form.C15H17N7O2
Mol. Mass.327.3412
SMILESCOc1ncc(cn1)-c1nc2c(C)nc(N)nc2n(C(C)C)c1=O