Reaction Details
TargetRAC-alpha serine/threonine-protein kinase
LigandBDBM50327907
Substrate/Competitorn/a
Meas. Tech.ChEMBL_665024 (CHEMBL1260134)
IC50 5.7±n/a nM
Citation Liu, KKBagrodia, SBailey, SCheng, HChen, HGao, LGreasley, SHoffman, JEHu, QJohnson, TOKnighton, DLiu, ZMarx, MANambu, MDNinkovic, SPascual, BRafidi, KRodgers, CMSmith, GLSun, SWang, HYang, AYuan, JZou, A 4-methylpteridinones as orally active and selective PI3K/mTOR dual inhibitors. Bioorg Med Chem Lett20:6096-9 (2010) 
 
RAC-alpha serine/threonine-protein kinase
Name:RAC-alpha serine/threonine-protein kinase
Type:Enzyme
Mol. Mass.:55681.25
Organism:Homo sapiens (Human)
Description:P31749
Residue:480
BDBM50327907
NameBDBM50327907
Synonyms:CHEMBL1257295 | trans-2-amino-8-(4-hydroxycyclohexyl)-4-methyl-6-(6-methylpyridin-3-yl)pteridin-7(8H)-one
TypeSmall organic molecule
Emp. Form.C19H22N6O2
Mol. Mass.366.417
SMILESCc1ccc(cn1)-c1nc2c(C)nc(N)nc2n([C@H]2CC[C@H](O)CC2)c1=O