Reaction Details
TargetEpidermal growth factor receptor
LigandBDBM50330230
Substrate/Competitorn/a
Meas. Tech.ChEMBL_676221 (CHEMBL1273341)
IC50 8±n/a nM
Citation Wu, CHCoumar, MSChu, CYLin, WHChen, YRChen, CTShiao, HYRafi, SWang, SYHsu, HChen, CHChang, CYChang, TYLien, TWFang, MYYeh, KCChen, CPYeh, TKHsieh, SHHsu, JTLiao, CCChao, YSHsieh, HP Design and synthesis of tetrahydropyridothieno[2,3-d]pyrimidine scaffold based epidermal growth factor receptor (EGFR) kinase inhibitors: the role of side chain chirality and Michael acceptor group for maximal potency. J Med Chem53:7316-26 (2010) 
 
Epidermal growth factor receptor
Name:Epidermal growth factor receptor
Type:Receptor Kinase Domain
Mol. Mass.:134279.59
Organism:Homo sapiens (Human)
Description:P00533
Residue:1210
BDBM50330230
NameBDBM50330230
Synonyms:1-(4-(((1S)-2-Hydroxy-1-phenylethyl)amino)-5,6,7,8-tetrahydropyrido[4',3':4,5]thieno[2,3-d]pyrimidin-7-yl)-2-propen-1-one | CHEMBL1272061
TypeSmall organic molecule
Emp. Form.C20H20N4O2S
Mol. Mass.380.463
SMILESOC[C@@H](Nc1ncnc2sc3CN(CCc3c12)C(=O)C=C)c1ccccc1