Reaction Details
TargetMitogen-activated protein kinase 8
LigandBDBM50332078
Substrate/Competitorn/a
Meas. Tech.ChEMBL_687739 (CHEMBL1291185)
IC50>50000±n/a nM
Citation Hom, RKBowers, SSealy, JMTruong, APProbst, GDNeitzel, MLNeitz, RJFang, LBrogley, LWu, JKonradi, AWSham, HLTóth, GPan, HYao, NArtis, DRQuinn, KSauer, JMPowell, KRen, ZBard, FYednock, TAGriswold-Prenner, I Design and synthesis of disubstituted thiophene and thiazole based inhibitors of JNK. Bioorg Med Chem Lett20:7303-7 (2010) 
 
Mitogen-activated protein kinase 8
Name:Mitogen-activated protein kinase 8
Type:Enzyme
Mol. Mass.:48297.57
Organism:Homo sapiens (Human)
Description:JNK-1 was purchased from Upstate Cell Signaling Solutions (formerly Upstate Biotechnology).
Residue:427
BDBM50332078
NameBDBM50332078
Synonyms:2-(4-methoxyphenyl)-N-(2-(2-oxooxazolidin-3-yl)thiophen-3-yl)acetamide US9796706, Compound 88
TypeSmall organic molecule
Emp. Form.C16H16N2O4S
Mol. Mass.332.374
SMILESCOc1ccc(CC(=O)Nc2ccsc2N2CCOC2=O)cc1