Reaction Details
TargetMitogen-activated protein kinase 9
LigandBDBM50332080
Substrate/Competitorn/a
Meas. Tech.ChEMBL_687740 (CHEMBL1291186)
IC50 8700±n/a nM
Citation Hom, RKBowers, SSealy, JMTruong, APProbst, GDNeitzel, MLNeitz, RJFang, LBrogley, LWu, JKonradi, AWSham, HLTóth, GPan, HYao, NArtis, DRQuinn, KSauer, JMPowell, KRen, ZBard, FYednock, TAGriswold-Prenner, I Design and synthesis of disubstituted thiophene and thiazole based inhibitors of JNK. Bioorg Med Chem Lett20:7303-7 (2010) 
 
Mitogen-activated protein kinase 9
Name:Mitogen-activated protein kinase 9
Type:Enzyme
Mol. Mass.:48131.49
Organism:Homo sapiens (Human)
Description:JNK-2 was purchased from Upstate Cell Signaling Solutions (formerly Upstate Biotechnology).
Residue:424
BDBM50332080
NameBDBM50332080
Synonyms:CHEMBL1288039 | N-(2-(5-amino-1H-1,2,4-triazol-3-yl)thiophen-3-yl)-2-(4-methoxyphenyl)acetamide
TypeSmall organic molecule
Emp. Form.C15H15N5O2S
Mol. Mass.329.377
SMILESCOc1ccc(CC(=O)Nc2ccsc2-c2nnc(N)[nH]2)cc1