Reaction Details
TargetMitogen-activated protein kinase 10
LigandBDBM50332064
Substrate/Competitorn/a
Meas. Tech.ChEMBL_687741 (CHEMBL1291187)
IC50 900±n/a nM
Citation Hom, RKBowers, SSealy, JMTruong, APProbst, GDNeitzel, MLNeitz, RJFang, LBrogley, LWu, JKonradi, AWSham, HLTóth, GPan, HYao, NArtis, DRQuinn, KSauer, JMPowell, KRen, ZBard, FYednock, TAGriswold-Prenner, I Design and synthesis of disubstituted thiophene and thiazole based inhibitors of JNK. Bioorg Med Chem Lett20:7303-7 (2010) 
 
Mitogen-activated protein kinase 10
Name:Mitogen-activated protein kinase 10
Type:Enzyme
Mol. Mass.:52586.89
Organism:Homo sapiens (Human)
Description:n/a
Residue:464
BDBM50332064
NameBDBM50332064
Synonyms:CHEMBL1287859 | methyl 4-(2-(naphthalen-1-yl)acetamido)thiophene-3-carboxylate
TypeSmall organic molecule
Emp. Form.C18H15NO3S
Mol. Mass.325.382
SMILESCOC(=O)c1cscc1NC(=O)Cc1cccc2ccccc12