Reaction Details
TargetMitogen-activated protein kinase 10
LigandBDBM50332066
Substrate/Competitorn/a
Meas. Tech.ChEMBL_687741 (CHEMBL1291187)
IC50 6500±n/a nM
Citation Hom, RKBowers, SSealy, JMTruong, APProbst, GDNeitzel, MLNeitz, RJFang, LBrogley, LWu, JKonradi, AWSham, HLTóth, GPan, HYao, NArtis, DRQuinn, KSauer, JMPowell, KRen, ZBard, FYednock, TAGriswold-Prenner, I Design and synthesis of disubstituted thiophene and thiazole based inhibitors of JNK. Bioorg Med Chem Lett20:7303-7 (2010) 
 
Mitogen-activated protein kinase 10
Name:Mitogen-activated protein kinase 10
Type:Enzyme
Mol. Mass.:52586.89
Organism:Homo sapiens (Human)
Description:n/a
Residue:464
BDBM50332066
NameBDBM50332066
Synonyms:CHEMBL1287887 | methyl 4-(2-(naphthalen-1-yl)acetamido)nicotinate
TypeSmall organic molecule
Emp. Form.C19H16N2O3
Mol. Mass.320.3419
SMILESCOC(=O)c1cnccc1NC(=O)Cc1cccc2ccccc12