Reaction Details
TargetMitogen-activated protein kinase 10
LigandBDBM50332070
Substrate/Competitorn/a
Meas. Tech.ChEMBL_687741 (CHEMBL1291187)
IC50 920±n/a nM
Citation Hom, RKBowers, SSealy, JMTruong, APProbst, GDNeitzel, MLNeitz, RJFang, LBrogley, LWu, JKonradi, AWSham, HLTóth, GPan, HYao, NArtis, DRQuinn, KSauer, JMPowell, KRen, ZBard, FYednock, TAGriswold-Prenner, I Design and synthesis of disubstituted thiophene and thiazole based inhibitors of JNK. Bioorg Med Chem Lett20:7303-7 (2010) 
 
Mitogen-activated protein kinase 10
Name:Mitogen-activated protein kinase 10
Type:Enzyme
Mol. Mass.:52586.89
Organism:Homo sapiens (Human)
Description:n/a
Residue:464
BDBM50332070
NameBDBM50332070
Synonyms:CHEMBL1287916 | N-(2-(1H-1,2,4-triazol-3-yl)thiophen-3-yl)-2-(naphthalen-1-yl)acetamide
TypeSmall organic molecule
Emp. Form.C18H14N4OS
Mol. Mass.334.395
SMILESO=C(Cc1cccc2ccccc12)Nc1ccsc1-c1nnc[nH]1