Reaction Details
TargetMitogen-activated protein kinase 10
LigandBDBM50332042
Substrate/Competitorn/a
Meas. Tech.ChEMBL_687741 (CHEMBL1291187)
IC50 17200±n/a nM
Citation Hom, RKBowers, SSealy, JMTruong, APProbst, GDNeitzel, MLNeitz, RJFang, LBrogley, LWu, JKonradi, AWSham, HLTóth, GPan, HYao, NArtis, DRQuinn, KSauer, JMPowell, KRen, ZBard, FYednock, TAGriswold-Prenner, I Design and synthesis of disubstituted thiophene and thiazole based inhibitors of JNK. Bioorg Med Chem Lett20:7303-7 (2010) 
 
Mitogen-activated protein kinase 10
Name:Mitogen-activated protein kinase 10
Type:Enzyme
Mol. Mass.:52586.89
Organism:Homo sapiens (Human)
Description:n/a
Residue:464
BDBM50332042
NameBDBM50332042
Synonyms:CHEMBL1288931 | methyl 3-(2-(pyridin-4-yl)acetamido)thiophene-2-carboxylate
TypeSmall organic molecule
Emp. Form.C13H12N2O3S
Mol. Mass.276.311
SMILESCOC(=O)c1sccc1NC(=O)Cc1ccncc1