Reaction Details
TargetMitogen-activated protein kinase 10
LigandBDBM50332044
Substrate/Competitorn/a
Meas. Tech.ChEMBL_687741 (CHEMBL1291187)
IC50 690±n/a nM
Citation Hom, RKBowers, SSealy, JMTruong, APProbst, GDNeitzel, MLNeitz, RJFang, LBrogley, LWu, JKonradi, AWSham, HLTóth, GPan, HYao, NArtis, DRQuinn, KSauer, JMPowell, KRen, ZBard, FYednock, TAGriswold-Prenner, I Design and synthesis of disubstituted thiophene and thiazole based inhibitors of JNK. Bioorg Med Chem Lett20:7303-7 (2010) 
 
Mitogen-activated protein kinase 10
Name:Mitogen-activated protein kinase 10
Type:Enzyme
Mol. Mass.:52586.89
Organism:Homo sapiens (Human)
Description:n/a
Residue:464
BDBM50332044
NameBDBM50332044
Synonyms:CHEMBL1288157 | methyl 3-(2-(4-(pyridin-4-yl)phenyl)acetamido)thiophene-2-carboxylate
TypeSmall organic molecule
Emp. Form.C19H16N2O3S
Mol. Mass.352.407
SMILESCOC(=O)c1sccc1NC(=O)Cc1ccc(cc1)-c1ccncc1