Reaction Details
TargetMitogen-activated protein kinase 10
LigandBDBM50332083
Substrate/Competitorn/a
Meas. Tech.ChEMBL_687741 (CHEMBL1291187)
IC50 27000±n/a nM
Citation Hom, RKBowers, SSealy, JMTruong, APProbst, GDNeitzel, MLNeitz, RJFang, LBrogley, LWu, JKonradi, AWSham, HLTóth, GPan, HYao, NArtis, DRQuinn, KSauer, JMPowell, KRen, ZBard, FYednock, TAGriswold-Prenner, I Design and synthesis of disubstituted thiophene and thiazole based inhibitors of JNK. Bioorg Med Chem Lett20:7303-7 (2010) 
 
Mitogen-activated protein kinase 10
Name:Mitogen-activated protein kinase 10
Type:Enzyme
Mol. Mass.:52586.89
Organism:Homo sapiens (Human)
Description:n/a
Residue:464
BDBM50332083
NameBDBM50332083
Synonyms:2-(4-methoxyphenyl)-N-(2-(2-methyl-1H-imidazol-4-yl)thiophen-3-yl)acetamide US9796706, Compound 82
TypeSmall organic molecule
Emp. Form.C17H17N3O2S
Mol. Mass.327.401
SMILESCOc1ccc(CC(=O)Nc2ccsc2-c2c[nH]c(C)n2)cc1