Reaction Details
TargetInhibitor of nuclear factor kappa-B kinase subunit alpha
LigandBDBM25919
Substrate/Competitorn/a
Meas. Tech.ChEMBL_699029 (CHEMBL1646310)
IC50 7000±n/a nM
Citation Dyckman, AJLangevine, CMQuesnelle, CKempson, JGuo, JGill, PSpergel, SHWatterson, SHLi, TNirschl, DSGillooly, KMPattoli, MAMcIntyre, KWChen, LMcKinnon, MDodd, JHBarrish, JCBurke, JRPitts, WJ Imidazo[4,5-d]thiazolo[5,4-b]pyridine based inhibitors of IKK2: synthesis, SAR, PK/PD and activity in a preclinical model of rheumatoid arthritis. Bioorg Med Chem Lett21:383-6 (2010) 
 
Inhibitor of nuclear factor kappa-B kinase subunit alpha
Name:Inhibitor of nuclear factor kappa-B kinase subunit alpha
Type:PROTEIN
Mol. Mass.:84642.21
Organism:Homo sapiens (Human)
Description:ChEMBL_327453
Residue:745
BDBM25919
NameBDBM25919
Synonyms:BMS-345541 CHEMBL471496 | N-(2-aminoethyl)-3,12-dimethyl-2,5,8-triazatricyclo[7.4.0.0^{2,6}]trideca-1(13),3,5,7,9,11-hexaen-7-amine
TypeSmall organic molecule
Emp. Form.C14H17N5
Mol. Mass.255.3183
SMILESCc1cnc2c(NCCN)nc3ccc(C)cc3n12