Reaction Details
Target11-beta-hydroxysteroid dehydrogenase 1
LigandBDBM50334688
Substrate/Competitorn/a
Meas. Tech.ChEMBL_699052 (CHEMBL1646333)
IC50 1.4±n/a nM
Citation Sun, DWang, ZCaille, SDeGraffenreid, MGonzalez-Lopez de Turiso, FHungate, RJaen, JCJiang, BJulian, LDKelly, RMcMinn, DLKaizerman, JRew, YSudom, ATu, HUrsu, SWalker, NWillcockson, MYan, XYe, QPowers, JP Synthesis and optimization of novel 4,4-disubstituted cyclohexylbenzamide derivatives as potent 11ß-HSD1 inhibitors. Bioorg Med Chem Lett21:405-10 (2010) 
 
11-beta-hydroxysteroid dehydrogenase 1
Name:11-beta-hydroxysteroid dehydrogenase 1
Type:Enzyme
Mol. Mass.:32409.16
Organism:Homo sapiens (Human)
Description:P28845
Residue:292
BDBM50334688
NameBDBM50334688
Synonyms:CHEMBL1642592 | N-((4S)-4-(2-amino-2-oxoethyl)-4-phenylcyclohexyl)-N-cyclopropyl-4-((S)-1,1,1-trifluoro-2-hydroxypropan-2-yl)benzamide
TypeSmall organic molecule
Emp. Form.C27H31F3N2O3
Mol. Mass.488.5418
SMILESC[C@](O)(c1ccc(cc1)C(=O)N(C1CC1)[C@H]1CC[C@@](CC(N)=O)(CC1)c1ccccc1)C(F)(F)F