Reaction Details
TargetC-C chemokine receptor type 2
LigandBDBM50339630
Substrate/Competitorn/a
Meas. Tech.ChEMBL_735000 (CHEMBL1693607)
IC50 1000±n/a nM
Citation Laborde, EMacsata, RWMeng, FPeterson, BTRobinson, LSchow, SRSimon, RJXu, HBaba, KInagaki, HIshiwata, YJomori, TMatsumoto, YMiyachi, ANakamura, TOkamoto, MHandel, TMBernard, CC Discovery, optimization, and pharmacological characterization of novel heteroaroylphenylureas antagonists of C-C chemokine ligand 2 function. J Med Chem54:1667-81 (2011) 
 
C-C chemokine receptor type 2
Name:C-C chemokine receptor type 2
Type:Enzyme
Mol. Mass.:41932.32
Organism:Homo sapiens (Human)
Description:P41597
Residue:374
BDBM50339630
NameBDBM50339630
Synonyms:1-(Benzo[d][1,3]dioxole-6-carbonyl)-3-(3-isopropoxyphenyl)urea | CHEMBL1687955
TypeSmall organic molecule
Emp. Form.C18H18N2O5
Mol. Mass.342.3459
SMILESCC(C)Oc1cccc(NC(=O)NC(=O)c2ccc3OCOc3c2)c1