Reaction Details
TargetC-C chemokine receptor type 2
LigandBDBM50339633
Substrate/Competitorn/a
Meas. Tech.ChEMBL_735000 (CHEMBL1693607)
IC50>10000±n/a nM
Citation Laborde, EMacsata, RWMeng, FPeterson, BTRobinson, LSchow, SRSimon, RJXu, HBaba, KInagaki, HIshiwata, YJomori, TMatsumoto, YMiyachi, ANakamura, TOkamoto, MHandel, TMBernard, CC Discovery, optimization, and pharmacological characterization of novel heteroaroylphenylureas antagonists of C-C chemokine ligand 2 function. J Med Chem54:1667-81 (2011) 
 
C-C chemokine receptor type 2
Name:C-C chemokine receptor type 2
Type:Enzyme
Mol. Mass.:41932.32
Organism:Homo sapiens (Human)
Description:P41597
Residue:374
BDBM50339633
NameBDBM50339633
Synonyms:1-(Benzo[d][1,3]dioxole-6-carbonyl)-3-(3-chlorophenyl)-1-methylurea | CHEMBL1688883
TypeSmall organic molecule
Emp. Form.C16H13ClN2O4
Mol. Mass.332.738
SMILESCN(C(=O)Nc1cccc(Cl)c1)C(=O)c1ccc2OCOc2c1