Reaction Details
TargetC-X-C chemokine receptor type 2
LigandBDBM50339635
Substrate/Competitorn/a
Meas. Tech.ChEMBL_735060 (CHEMBL1693901)
IC50>10000±n/a nM
Citation Laborde, EMacsata, RWMeng, FPeterson, BTRobinson, LSchow, SRSimon, RJXu, HBaba, KInagaki, HIshiwata, YJomori, TMatsumoto, YMiyachi, ANakamura, TOkamoto, MHandel, TMBernard, CC Discovery, optimization, and pharmacological characterization of novel heteroaroylphenylureas antagonists of C-C chemokine ligand 2 function. J Med Chem54:1667-81 (2011) 
 
C-X-C chemokine receptor type 2
Name:C-X-C chemokine receptor type 2
Type:Protein
Mol. Mass.:40767.88
Organism:Homo sapiens (Human)
Description:P25025
Residue:360
BDBM50339635
NameBDBM50339635
Synonyms:1-(1,3-Dimethyl-1H-pyrazolo[3,4-b]pyridine-5-carbonyl)-3-(4-fluoro-3-(trifluoromethyl)phenyl)urea | CHEMBL1688888
TypeSmall organic molecule
Emp. Form.C17H13F4N5O2
Mol. Mass.395.311
SMILESCc1nn(C)c2ncc(cc12)C(=O)NC(=O)Nc1ccc(F)c(c1)C(F)(F)F