Reaction Details
Target3-phosphoinositide-dependent protein kinase 1
LigandBDBM50341245
Substrate/Competitorn/a
Meas. Tech.ChEMBL_742335 (CHEMBL1768784)
IC50 88±n/a nM
Citation Medina, JRBecker, CJBlackledge, CWDuquenne, CFeng, YGrant, SWHeerding, DLi, WHMiller, WHRomeril, SPScherzer, DShu, ABobko, MAChadderton, ARDumble, MGardiner, CMGilbert, SLiu, QRabindran, SKSudakin, VXiang, HBrady, PGCampobasso, NWard, PAxten, JM Structure-based design of potent and selective 3-phosphoinositide-dependent kinase-1 (PDK1) inhibitors. J Med Chem54:1871-95 (2011) 
 
3-phosphoinositide-dependent protein kinase 1
Name:3-phosphoinositide-dependent protein kinase 1
Type:Enzyme
Mol. Mass.:63157.65
Organism:Homo sapiens (Human)
Description:O15530
Residue:556
BDBM50341245
NameBDBM50341245
Synonyms:(2S,5R)-4-[6-(3-Amino-1H-indazol-6-yl)-2-(methylamino)-4-pyrimidinyl]-5-ethyl-N-phenyl-2-morpholinecarboxamide | CHEMBL1765742
TypeSmall organic molecule
Emp. Form.C25H28N8O2
Mol. Mass.472.5422
SMILESCC[C@@H]1CO[C@@H](CN1c1cc(nc(NC)n1)-c1ccc2c(N)n[nH]c2c1)C(=O)Nc1ccccc1