Reaction Details
Target3-phosphoinositide-dependent protein kinase 1
LigandBDBM50341239
Substrate/Competitorn/a
Meas. Tech.ChEMBL_742334 (CHEMBL1768783)
IC50 3.2±n/a nM
Citation Medina, JRBecker, CJBlackledge, CWDuquenne, CFeng, YGrant, SWHeerding, DLi, WHMiller, WHRomeril, SPScherzer, DShu, ABobko, MAChadderton, ARDumble, MGardiner, CMGilbert, SLiu, QRabindran, SKSudakin, VXiang, HBrady, PGCampobasso, NWard, PAxten, JM Structure-based design of potent and selective 3-phosphoinositide-dependent kinase-1 (PDK1) inhibitors. J Med Chem54:1871-95 (2011) 
 
3-phosphoinositide-dependent protein kinase 1
Name:3-phosphoinositide-dependent protein kinase 1
Type:Enzyme
Mol. Mass.:63157.65
Organism:Homo sapiens (Human)
Description:O15530
Residue:556
BDBM50341239
NameBDBM50341239
Synonyms:(3S,6R)-1-[2-Amino-6-(3-amino-1H-indazol-6-yl)-4-pyrimidinyl]-6-methyl-N-phenyl-3-piperidinecarboxamide CHEMBL1614775
TypeSmall organic molecule
Emp. Form.C24H26N8O
Mol. Mass.442.5162
SMILESC[C@@H]1CC[C@@H](CN1c1cc(nc(N)n1)-c1ccc2c(N)[nH]nc2c1)C(=O)Nc1ccccc1