Reaction Details
Target3-phosphoinositide-dependent protein kinase 1
LigandBDBM50418241
Substrate/Competitorn/a
Meas. Tech.ChEMBL_742334 (CHEMBL1768783)
IC50 20±n/a nM
Citation Medina, JRBecker, CJBlackledge, CWDuquenne, CFeng, YGrant, SWHeerding, DLi, WHMiller, WHRomeril, SPScherzer, DShu, ABobko, MAChadderton, ARDumble, MGardiner, CMGilbert, SLiu, QRabindran, SKSudakin, VXiang, HBrady, PGCampobasso, NWard, PAxten, JM Structure-based design of potent and selective 3-phosphoinositide-dependent kinase-1 (PDK1) inhibitors. J Med Chem54:1871-95 (2011) 
 
3-phosphoinositide-dependent protein kinase 1
Name:3-phosphoinositide-dependent protein kinase 1
Type:Enzyme
Mol. Mass.:63157.65
Organism:Homo sapiens (Human)
Description:O15530
Residue:556
BDBM50418241
NameBDBM50418241
Synonyms:CHEMBL1614774
TypeSmall organic molecule
Emp. Form.C22H22N8O2
Mol. Mass.430.4625
SMILESNc1[nH]nc2cc(ccc12)-c1cc(nc(N)n1)N1CCO[C@@H](C1)C(=O)Nc1ccccc1