Reaction Details
Target3-phosphoinositide-dependent protein kinase 1
LigandBDBM50418245
Substrate/Competitorn/a
Meas. Tech.ChEMBL_742334 (CHEMBL1768783)
IC50 63±n/a nM
Citation Medina, JRBecker, CJBlackledge, CWDuquenne, CFeng, YGrant, SWHeerding, DLi, WHMiller, WHRomeril, SPScherzer, DShu, ABobko, MAChadderton, ARDumble, MGardiner, CMGilbert, SLiu, QRabindran, SKSudakin, VXiang, HBrady, PGCampobasso, NWard, PAxten, JM Structure-based design of potent and selective 3-phosphoinositide-dependent kinase-1 (PDK1) inhibitors. J Med Chem54:1871-95 (2011) 
 
3-phosphoinositide-dependent protein kinase 1
Name:3-phosphoinositide-dependent protein kinase 1
Type:Enzyme
Mol. Mass.:63157.65
Organism:Homo sapiens (Human)
Description:O15530
Residue:556
BDBM50418245
NameBDBM50418245
Synonyms:CHEMBL1765734
TypeSmall organic molecule
Emp. Form.C23H30N8O
Mol. Mass.434.5373
SMILESNc1n[nH]c2cc(ccc12)-c1cc(nc(N)n1)N1CCC[C@@H](C1)C(=O)NC1CCCCC1