Reaction Details
TargetCytochrome P450 3A4
LigandBDBM50297308
Substrate/Competitorn/a
Meas. Tech.ChEMBL_760135 (CHEMBL1815391)
IC50>10000±n/a nM
Citation Moree, WJLi, BFZamani-Kord, SYu, JCoon, THuang, CMarinkovic, DTucci, FCMalany, SBradbury, MJHernandez, LMWen, JWang, HHoare, SRPetroski, REJalali, KYang, CSacaan, AMadan, ACrowe, PDBeaton, G Identification of a novel selective H1-antihistamine with optimized pharmacokinetic properties for clinical evaluation in the treatment of insomnia. Bioorg Med Chem Lett20:5874-8 (2010) 
 
Cytochrome P450 3A4
Name:Cytochrome P450 3A4
Type:Enzyme
Mol. Mass.:57349.57
Organism:Homo sapiens (Human)
Description:n/a
Residue:503
BDBM50297308
NameBDBM50297308
Synonyms:(-)-Dimethyl-{2-[3-((R)-1-pyrazin-2-yl-ethyl)-1H-inden-2-yl]-ethyl}-amine CHEMBL556506
TypeSmall organic molecule
Emp. Form.C19H23N3
Mol. Mass.293.406
SMILESC[C@H](C1=C(CCN(C)C)Cc2ccccc12)c1cnccn1