Reaction Details
TargetHistamine H1 receptor
LigandBDBM50297308
Substrate/Competitorn/a
Meas. Tech.ChEMBL_760134 (CHEMBL1815390)
Ki 1.5±n/a nM
Citation Moree, WJLi, BFZamani-Kord, SYu, JCoon, THuang, CMarinkovic, DTucci, FCMalany, SBradbury, MJHernandez, LMWen, JWang, HHoare, SRPetroski, REJalali, KYang, CSacaan, AMadan, ACrowe, PDBeaton, G Identification of a novel selective H1-antihistamine with optimized pharmacokinetic properties for clinical evaluation in the treatment of insomnia. Bioorg Med Chem Lett20:5874-8 (2010) 
 
Histamine H1 receptor
Name:Histamine H1 receptor
Type:G Protein-Coupled Receptor (GPCR)
Mol. Mass.:55808.72
Organism:Homo sapiens (Human)
Description:Cell pellets from SK-N-MC cells transfected with human H1 receptor were used in binding assay.
Residue:487
BDBM50297308
NameBDBM50297308
Synonyms:(-)-Dimethyl-{2-[3-((R)-1-pyrazin-2-yl-ethyl)-1H-inden-2-yl]-ethyl}-amine CHEMBL556506
TypeSmall organic molecule
Emp. Form.C19H23N3
Mol. Mass.293.406
SMILESC[C@H](C1=C(CCN(C)C)Cc2ccccc12)c1cnccn1