Reaction Details
TargetAppetite-regulating hormone
LigandBDBM50359259
Substrate/Competitorn/a
Meas. Tech.ChEMBL_790253 (CHEMBL1925646)
Ki 4.4±n/a nM
Citation Hoveyda, HRMarsault, EGagnon, RMathieu, APVézina, MLandry, AWang, ZBenakli, KBeaubien, SSaint-Louis, CBrassard, MPinault, JFOuellet, LBhat, SRamaseshan, MPeng, XFoucher, LBeauchemin, SBhérer, PVeber, DFPeterson, MLFraser, GL Optimization of the potency and pharmacokinetic properties of a macrocyclic ghrelin receptor agonist (Part I): Development of ulimorelin (TZP-101) from hit to clinic. J Med Chem54:8305-20 (2011) 
 
Appetite-regulating hormone
Name:Appetite-regulating hormone
Type:PROTEIN
Mol. Mass.:12908.57
Organism:Homo sapiens (Human)
Description:ChEMBL_790253
Residue:117
BDBM50359259
NameBDBM50359259
Synonyms:CHEMBL1923610
TypeSmall organic molecule
Emp. Form.C29H38N4O4
Mol. Mass.506.6364
SMILESC[C@H]1N(C)C(=O)[C@@H](NCCOc2ccccc2CCCNC(=O)[C@@H](Cc2ccccc2)NC1=O)C1CC1