Reaction Details
TargetcGMP-specific 3',5'-cyclic phosphodiesterase
LigandBDBM50246483
Substrate/Competitorn/a
Meas. Tech.ChEMBL_791631 (CHEMBL1930855)
IC50 1.1±n/a nM
Citation Rawson, DJBallard, SBarber, CBarker, LBeaumont, KBunnage, MCole, SCorless, MDenton, SEllis, DFloc'h, MFoster, LGosset, JHolmwood, FLane, CLeahy, DMathias, JMaw, GMillion, WPoinsard, CPrice, JRussel, RStreet, SWatson, L The discovery of UK-369003, a novel PDE5 inhibitor with the potential for oral bioavailability and dose-proportional pharmacokinetics. Bioorg Med Chem20:498-509 (2011) 
 
cGMP-specific 3',5'-cyclic phosphodiesterase
Name:cGMP-specific 3',5'-cyclic phosphodiesterase
Type:Protein
Mol. Mass.:99975.83
Organism:Homo sapiens (Human)
Description:O76074
Residue:875
BDBM50246483
NameBDBM50246483
Synonyms:3-ethyl-5-(5-(4-ethylpiperazin-1-ylsulfonyl)-2-propoxypyridin-3-yl)-2-(pyridin-2-ylmethyl)-2H-pyrazolo[4,3-d]pyrimidin-7(6H)-one UK-343664
TypeSmall organic molecule
Emp. Form.C27H34N8O4S
Mol. Mass.566.675
SMILESCCCOc1ncc(cc1-c1nc2c(CC)n(Cc3ccccn3)nc2c(=O)[nH]1)S(=O)(=O)N1CCN(CC)CC1