Reaction Details
TargetcGMP-specific 3',5'-cyclic phosphodiesterase
LigandBDBM50359778
Substrate/Competitorn/a
Meas. Tech.ChEMBL_791631 (CHEMBL1930855)
IC50 0.860000±n/a nM
Citation Rawson, DJBallard, SBarber, CBarker, LBeaumont, KBunnage, MCole, SCorless, MDenton, SEllis, DFloc'h, MFoster, LGosset, JHolmwood, FLane, CLeahy, DMathias, JMaw, GMillion, WPoinsard, CPrice, JRussel, RStreet, SWatson, L The discovery of UK-369003, a novel PDE5 inhibitor with the potential for oral bioavailability and dose-proportional pharmacokinetics. Bioorg Med Chem20:498-509 (2011) 
 
cGMP-specific 3',5'-cyclic phosphodiesterase
Name:cGMP-specific 3',5'-cyclic phosphodiesterase
Type:Protein
Mol. Mass.:99975.83
Organism:Homo sapiens (Human)
Description:O76074
Residue:875
BDBM50359778
NameBDBM50359778
Synonyms:CHEMBL1928270
TypeSmall organic molecule
Emp. Form.C26H38N8O5S
Mol. Mass.574.696
SMILESCCOc1ncc(cc1-c1nc2c(CC)n(CCN3CCOCC3)nc2c(=O)[nH]1)S(=O)(=O)N1CCN(CC)CC1