Reaction Details
TargetSphingosine 1-phosphate receptor 1
LigandBDBM50361043
Substrate/Competitorn/a
Meas. Tech.ChEMBL_796042 (CHEMBL1936575)
EC50 20±n/a nM
Citation Kurata, HKusumi, KOtsuki, KSuzuki, RKurono, MTokuda, NTakada, YShioya, HMizuno, HKomiya, TOno, THagiya, HMinami, MNakade, SHabashita, H Structure-activity relationship studies of S1P agonists with a dihydronaphthalene scaffold. Bioorg Med Chem Lett22:144-8 (2011) 
 
Sphingosine 1-phosphate receptor 1
Name:Sphingosine 1-phosphate receptor 1
Type:Enzyme
Mol. Mass.:42836.02
Organism:Homo sapiens (Human)
Description:P21453
Residue:382
BDBM50361043
NameBDBM50361043
Synonyms:CHEMBL1935582
TypeSmall organic molecule
Emp. Form.C27H33NO3
Mol. Mass.419.5558
SMILESCC1=C(CN2CC(C2)C(O)=O)CCc2cc(OCC(C)(C)Cc3ccccc3)ccc12