Reaction Details
TargetSphingosine 1-phosphate receptor 3
LigandBDBM50361036
Substrate/Competitorn/a
Meas. Tech.ChEMBL_796043 (CHEMBL1936576)
EC50 5000±n/a nM
Citation Kurata, HKusumi, KOtsuki, KSuzuki, RKurono, MTokuda, NTakada, YShioya, HMizuno, HKomiya, TOno, THagiya, HMinami, MNakade, SHabashita, H Structure-activity relationship studies of S1P agonists with a dihydronaphthalene scaffold. Bioorg Med Chem Lett22:144-8 (2011) 
 
Sphingosine 1-phosphate receptor 3
Name:Sphingosine 1-phosphate receptor 3
Type:G Protein-Coupled Receptor (GPCR)
Mol. Mass.:42278.13
Organism:Homo sapiens (Human)
Description:Q99500
Residue:378
BDBM50361036
NameBDBM50361036
Synonyms:CHEMBL1935575
TypeSmall organic molecule
Emp. Form.C25H29NO3
Mol. Mass.391.5027
SMILESCC1=C(CN2CC(C2)C(O)=O)CCc2cc(OCCCc3ccccc3)ccc12