Reaction Details
TargetSphingosine 1-phosphate receptor 3
LigandBDBM50361048
Substrate/Competitorn/a
Meas. Tech.ChEMBL_796043 (CHEMBL1936576)
EC50 8200±n/a nM
Citation Kurata, HKusumi, KOtsuki, KSuzuki, RKurono, MTokuda, NTakada, YShioya, HMizuno, HKomiya, TOno, THagiya, HMinami, MNakade, SHabashita, H Structure-activity relationship studies of S1P agonists with a dihydronaphthalene scaffold. Bioorg Med Chem Lett22:144-8 (2011) 
 
Sphingosine 1-phosphate receptor 3
Name:Sphingosine 1-phosphate receptor 3
Type:G Protein-Coupled Receptor (GPCR)
Mol. Mass.:42278.13
Organism:Homo sapiens (Human)
Description:Q99500
Residue:378
BDBM50361048
NameBDBM50361048
Synonyms:CHEMBL1935587
TypeSmall organic molecule
Emp. Form.C26H30ClNO3
Mol. Mass.439.974
SMILESC[C@H](COc1ccc2C(C)=C(CN3CC(C3)C(O)=O)CCc2c1)Cc1ccc(Cl)cc1