Reaction Details
TargetPotassium voltage-gated channel subfamily H member 2
LigandBDBM50364187
Substrate/Competitorn/a
Meas. Tech.ChEMBL_803863 (CHEMBL1954401)
IC50 12000±n/a nM
Citation Sutton, JMClark, DEDunsdon, SJFenton, GFillmore, AHarris, NVHiggs, CHurley, CAKrintel, SLMacKenzie, REDuttaroy, AGangl, EManiara, WSedrani, RNamoto, KOstermann, NGerhartz, BSirockin, FTrappe, JHassiepen, UBaeschlin, DK Novel heterocyclic DPP-4 inhibitors for the treatment of type 2 diabetes. Bioorg Med Chem Lett22:1464-8 (2012) 
 
Potassium voltage-gated channel subfamily H member 2
Name:Potassium voltage-gated channel subfamily H member 2
Type:Multi-pass membrane protein
Mol. Mass.:126672.65
Organism:Homo sapiens (Human)
Description:Q12809
Residue:1159
BDBM50364187
NameBDBM50364187
Synonyms:CHEMBL1951416
TypeSmall organic molecule
Emp. Form.C28H26N8O2
Mol. Mass.506.5584
SMILESCC#CCn1c(N2CCCNCC2)c(C#N)c2n(C)c(=O)n(Cc3ncc4ccccc4c3C#N)c(=O)c12