Reaction Details
TargetDipeptidyl peptidase 4
LigandBDBM50364166
Substrate/Competitorn/a
Meas. Tech.ChEMBL_803854 (CHEMBL1954392)
IC50 25±n/a nM
Citation Sutton, JMClark, DEDunsdon, SJFenton, GFillmore, AHarris, NVHiggs, CHurley, CAKrintel, SLMacKenzie, REDuttaroy, AGangl, EManiara, WSedrani, RNamoto, KOstermann, NGerhartz, BSirockin, FTrappe, JHassiepen, UBaeschlin, DK Novel heterocyclic DPP-4 inhibitors for the treatment of type 2 diabetes. Bioorg Med Chem Lett22:1464-8 (2012) 
 
Dipeptidyl peptidase 4
Name:Dipeptidyl peptidase 4
Type:Enzyme
Mol. Mass.:88271.01
Organism:Homo sapiens (Human)
Description:P27487
Residue:766
BDBM50364166
NameBDBM50364166
Synonyms:CHEMBL1951422
TypeSmall organic molecule
Emp. Form.C28H28N6O3
Mol. Mass.496.5603
SMILESCOc1cccc(c1)C(=O)Cn1cnc2c(C#N)c(N3CCC[C@@H](N)C3)n(Cc3ccccc3)c2c1=O