Reaction Details
TargetDipeptidyl peptidase 4
LigandBDBM50364164
Substrate/Competitorn/a
Meas. Tech.ChEMBL_803854 (CHEMBL1954392)
IC50 17±n/a nM
Citation Sutton, JMClark, DEDunsdon, SJFenton, GFillmore, AHarris, NVHiggs, CHurley, CAKrintel, SLMacKenzie, REDuttaroy, AGangl, EManiara, WSedrani, RNamoto, KOstermann, NGerhartz, BSirockin, FTrappe, JHassiepen, UBaeschlin, DK Novel heterocyclic DPP-4 inhibitors for the treatment of type 2 diabetes. Bioorg Med Chem Lett22:1464-8 (2012) 
 
Dipeptidyl peptidase 4
Name:Dipeptidyl peptidase 4
Type:Enzyme
Mol. Mass.:88271.01
Organism:Homo sapiens (Human)
Description:P27487
Residue:766
BDBM50364164
NameBDBM50364164
Synonyms:CHEMBL1951424
TypeSmall organic molecule
Emp. Form.C29H27N7O
Mol. Mass.489.571
SMILESN[C@H]1CCCN(C1)c1c(C#N)c2ncn(Cc3ccnc4ccccc34)c(=O)c2n1Cc1ccccc1