Reaction Details
TargetDipeptidyl peptidase 4
LigandBDBM50364170
Substrate/Competitorn/a
Meas. Tech.ChEMBL_803854 (CHEMBL1954392)
IC50 4±n/a nM
Citation Sutton, JMClark, DEDunsdon, SJFenton, GFillmore, AHarris, NVHiggs, CHurley, CAKrintel, SLMacKenzie, REDuttaroy, AGangl, EManiara, WSedrani, RNamoto, KOstermann, NGerhartz, BSirockin, FTrappe, JHassiepen, UBaeschlin, DK Novel heterocyclic DPP-4 inhibitors for the treatment of type 2 diabetes. Bioorg Med Chem Lett22:1464-8 (2012) 
 
Dipeptidyl peptidase 4
Name:Dipeptidyl peptidase 4
Type:Enzyme
Mol. Mass.:88271.01
Organism:Homo sapiens (Human)
Description:P27487
Residue:766
BDBM50364170
NameBDBM50364170
Synonyms:CHEMBL1951596
TypeSmall organic molecule
Emp. Form.C30H29N7O2
Mol. Mass.519.597
SMILESCn1c2c(C#N)c(N3CCC[C@H](N)C3)n(Cc3ccccc3)c2c(=O)n(Cc2nccc3ccccc23)c1=O