Reaction Details
TargetDipeptidyl peptidase 4
LigandBDBM50364175
Substrate/Competitorn/a
Meas. Tech.ChEMBL_803854 (CHEMBL1954392)
IC50 25±n/a nM
Citation Sutton, JMClark, DEDunsdon, SJFenton, GFillmore, AHarris, NVHiggs, CHurley, CAKrintel, SLMacKenzie, REDuttaroy, AGangl, EManiara, WSedrani, RNamoto, KOstermann, NGerhartz, BSirockin, FTrappe, JHassiepen, UBaeschlin, DK Novel heterocyclic DPP-4 inhibitors for the treatment of type 2 diabetes. Bioorg Med Chem Lett22:1464-8 (2012) 
 
Dipeptidyl peptidase 4
Name:Dipeptidyl peptidase 4
Type:Enzyme
Mol. Mass.:88271.01
Organism:Homo sapiens (Human)
Description:P27487
Residue:766
BDBM50364175
NameBDBM50364175
Synonyms:CHEMBL1951602
TypeSmall organic molecule
Emp. Form.C25H28N8O2
Mol. Mass.472.5422
SMILES[#6]\[#6](-[#6])=[#6]\[#6]-n1c(-[#7]-2-[#6]-[#6]-[#6]-[#6@H](-[#7])-[#6]-2)c(C#N)c2n(-[#6])c(=O)n(-[#6]-c3ncccc3C#N)c(=O)c12