Reaction Details
TargetDipeptidyl peptidase 4
LigandBDBM50364168
Substrate/Competitorn/a
Meas. Tech.ChEMBL_803854 (CHEMBL1954392)
IC50 7.5±n/a nM
Citation Sutton, JMClark, DEDunsdon, SJFenton, GFillmore, AHarris, NVHiggs, CHurley, CAKrintel, SLMacKenzie, REDuttaroy, AGangl, EManiara, WSedrani, RNamoto, KOstermann, NGerhartz, BSirockin, FTrappe, JHassiepen, UBaeschlin, DK Novel heterocyclic DPP-4 inhibitors for the treatment of type 2 diabetes. Bioorg Med Chem Lett22:1464-8 (2012) 
 
Dipeptidyl peptidase 4
Name:Dipeptidyl peptidase 4
Type:Enzyme
Mol. Mass.:88271.01
Organism:Homo sapiens (Human)
Description:P27487
Residue:766
BDBM50364168
NameBDBM50364168
Synonyms:CHEMBL1951613
TypeSmall organic molecule
Emp. Form.C27H28N8O2
Mol. Mass.496.5636
SMILESCC#CCn1c(N2CCCNCC2)c(C#N)c2n(C)c(=O)n(Cc3nc(C)c4ccccc4n3)c(=O)c12