Reaction Details
Target72 kDa type IV collagenase
LigandBDBM50365344
Substrate/Competitorn/a
Meas. Tech.ChEMBL_806639 (CHEMBL1960122)
Ki>10000±n/a nM
Citation Brown, MFReilly, UAbramite, JAArcari, JTOliver, RBarham, RAChe, YChen, JMCollantes, EMChung, SWDesbonnet, CDoty, JDoroski, MEngtrakul, JJHarris, TMHuband, MKnafels, JDLeach, KLLiu, SMarfat, AMarra, AMcElroy, EMelnick, MMenard, CAMontgomery, JIMullins, LNoe, MCO'Donnell, JPenzien, JPlummer, MSPrice, LMShanmugasundaram, VThoma, CUccello, DPWarmus, JSWishka, DG Potent inhibitors of LpxC for the treatment of Gram-negative infections. J Med Chem55:914-23 (2012) 
 
72 kDa type IV collagenase
Name:72 kDa type IV collagenase
Type:Enzyme
Mol. Mass.:73870.36
Organism:Homo sapiens (Human)
Description: P08253
Residue:660
BDBM50365344
NameBDBM50365344
Synonyms:CHEMBL1956115
TypeSmall organic molecule
Emp. Form.C18H21NO4S
Mol. Mass.347.429
SMILESC[C@@](CCc1ccc(cc1)-c1ccccc1)(C(=O)NO)S(C)(=O)=O