Reaction Details
TargetType-2 angiotensin II receptor
LigandBDBM50449917
Substrate/Competitorn/a
Meas. Tech.ChEMBL_35419 (CHEMBL643593)
Ki 6500±n/a nM
Citation Poss, MAGu, ZRyono, DEReid, JASieber-McMaster, ESpitzmiller, ERDejneka, TDickinson, KEWilliams, SBMoreland, SDelaney, CLBird, JWaldron, TLSchaeffer, TRHedberg, SPetrillo, EW 1,4-substituted indoles: a potent and selective class of angiostensin II receptor antagonists Bioorg Med Chem Lett4:145-150 (1994)    Article
 
Type-2 angiotensin II receptor
Name:Type-2 angiotensin II receptor
Type:Enzyme Catalytic Domain
Mol. Mass.:41346.62
Organism:RAT
Description:Angiotensin II AT2 0 0::P35351
Residue:363
BDBM50449917
NameBDBM50449917
Synonyms:BMS-180560 | CHEMBL2021417
TypeSmall organic molecule
Emp. Form.C24H22ClLi2N7O3
Mol. Mass.505.812
SMILES[Li+].[Li]O.CCCCc1nc(Cl)c(C([O-])=O)n1Cc1cccc2n(ccc12)-c1ccccc1-c1nn[nH]n1